{"text_format":"1","workbook":"xlsx","n_sheets":5,"sheets":["Form","Sheet1","Hidden List and Formulas","SAP Post","JV"],"not_rendered":{"charts":0,"images":1,"macros":1,"external_links":0,"defined_names":4,"comments":1,"pivot_tables":0},"unopened":[],"bounds":{"document_bytes":16777216,"sheet_cells":100000,"rows_first":2000,"rows_last":500,"rows_between":2000,"halvings":0,"cell_chars":16384,"cell_head_chars":4096},"cells_cut":0,"cells_raw":0,"read":"whole","date_system":"1900"}

{"sheet":"Form","index":0,"n_rows":53,"n_cols":22,"rows_kept":53,"cut":false,"hidden":false,"merged":[[1,2,1,10],[3,4,3,10],[20,3,20,8],[20,9,20,16],[23,2,24,2],[13,4,13,13],[4,1,4,16],[21,3,21,7],[2,0,2,1],[14,1,14,2],[2,4,2,10],[7,0,7,1],[19,1,19,2],[17,1,17,2],[16,1,16,2],[18,1,18,2],[13,19,14,20],[16,19,17,20],[18,19,19,20],[18,18,19,18],[16,18,17,18],[13,18,14,18],[52,0,52,17],[31,4,31,15],[26,4,26,15],[27,4,27,15],[28,4,28,15],[29,4,29,15],[36,4,36,15],[30,4,30,15],[37,4,37,15],[45,0,45,16],[33,4,33,15],[34,4,34,15],[38,4,38,15],[39,4,39,15],[40,4,40,15],[44,4,44,15],[50,0,50,17],[51,0,51,17],[23,4,23,15],[24,4,24,15],[19,9,19,16],[19,3,19,8],[23,3,24,3],[21,0,21,1],[23,0,24,0],[35,4,35,15],[41,4,41,15],[32,4,32,15],[23,1,24,1],[43,4,43,15],[25,4,25,15],[42,4,42,15]]}
["Please enable macros to use this form.",null,null," "]
[1,2,null,null,null,null,null,null,null,null,null,null,null,null,null,null,null,"The most updated form can be found at:",null,null,null," "]
["1. Click to start -->",null,null,null,null,null,null,null,null,null,null,null,null,null,null,null,null,"http://vpf.mit.edu/site/cashier/forms "]
[]
[null,"Check Deposit",null,null,null,null,null,null,null,null,null,null,null,null,null,null,null,"V.2.4"]
["2. Please select type of checks"]
[]
[]
[{"$f":"IF(A2=1, \"3. Is the amount over or under $2,000?\",\"3. Please select how checks will be deposited\")","v":"3. Is the amount over or under $2,000?"}]
[]
[]
[{"$f":"IF(A2=1,\"Please print this form and send it along with the checks to:\",IF(B2=1,\"Please print this form and send it along with the checks to:\",\"Please deposit the checks and email the form (as an Excel file) to:\"))","v":"Please print this form and send it along with the checks to:"}]
[{"$f":"IF(A2=1,IF(B2=1,\"Attn: Christina Mansdorf at W98-300\",\"Alumni Association/Office of Records at W98-220\"),IF(B2=1,\"Cashier's Office: NE49-3182B\",\"Cashiers-office@mit.edu\"))","v":"Alumni Association/Office of Records at W98-220"}]
[null,"Fill in blue highlighted fields only.",null,"Department"]
["Date",{"$f":"TODAY()","v":"2014-05-30"},null,{"$f":"IF(SUM(E15:O16)>0,\"Please check line:\",\"\")","v":""},{"$f":"IF(S26=\"\",\"\",26)","v":""},{"$f":"IF(S27=\"\",\"\",27)","v":""},{"$f":"IF(S28=\"\",\"\",28)","v":""},{"$f":"IF(S29=\"\",\"\",29)","v":""},{"$f":"IF(S30=\"\",\"\",30)","v":""},{"$f":"IF(S31=\"\",\"\",31)","v":""},{"$f":"IF(S32=\"\",\"\",32)","v":""},{"$f":"IF(S33=\"\",\"\",33)","v":""},{"$f":"IF(S34=\"\",\"\",34)","v":""},{"$f":"IF(S35=\"\",\"\",35)","v":""},{"$f":"IF(S36=\"\",\"\",36)","v":""}]
["Form #",15048426,null,null,{"$f":"IF(S37=\"\",\"\",37)","v":""},{"$f":"IF(S38=\"\",\"\",38)","v":""},{"$f":"IF(S39=\"\",\"\",39)","v":""},{"$f":"IF(S40=\"\",\"\",40)","v":""},{"$f":"IF(S41=\"\",\"\",41)","v":""},{"$f":"IF(S42=\"\",\"\",42)","v":""},{"$f":"IF(S43=\"\",\"\",43)","v":""},{"$f":"IF(S44=\"\",\"\",44)","v":""},{"$f":"IF(S45=\"\",\"\",45)","v":""}]
["Name"]
["Telephone"]
["MIT ID #",null,null,"MIT ID number or email address is required to receive an email receipt."]
["E-mail",null,null,{"$f":"IF(OR(AND(NOT(Q26=0),A26=0),AND(NOT(Q27=0),A27=0),AND(NOT(Q28=0),A28=0),AND(NOT(Q29=0),A26=0),AND(NOT(Q29=0),A26=0),AND(NOT(Q30=0),A30=0),AND(NOT(Q31=0),A31=0),AND(NOT(Q32=0),A32=0),AND(NOT(Q33=0),A33=0),AND(NOT(Q34=0),A34=0),AND(NOT(Q35=0),A35=0),AND(NOT(Q36=0),A36=0),AND(NOT(Q37=0),A37=0),AND(NOT(Q37=0),A37=0),AND(NOT(Q38=0),A38=0),AND(NOT(Q39=0),A39=0),AND(NOT(Q40=0),A40=0),AND(NOT(Q41=0),A41=0),AND(NOT(Q42=0),A42=0),AND(NOT(Q43=0),A43=0),AND(NOT(Q44=0),A44=0),AND(NOT(Q45=0),A45=0),),\"Please include cost object\",\"\")","v":""},null,null,null,null,null,{"$f":"IF(OR(AND(NOT(Q26=0),C26=0),AND(NOT(Q27=0),C27=0),AND(NOT(Q28=0),C28=0),AND(NOT(Q29=0),C29=0),AND(NOT(Q29=0),C26=0),AND(NOT(Q30=0),C30=0),AND(NOT(Q31=0),C31=0),AND(NOT(Q32=0),C32=0),AND(NOT(Q33=0),C33=0),AND(NOT(Q34=0),C34=0),AND(NOT(Q35=0),C35=0),AND(NOT(Q36=0),C36=0),AND(NOT(Q37=0),C37=0),AND(NOT(Q37=0),C37=0),AND(NOT(Q38=0),C38=0),AND(NOT(Q39=0),C39=0),AND(NOT(Q40=0),C40=0),AND(NOT(Q41=0),C41=0),AND(NOT(Q42=0),C42=0),AND(NOT(Q43=0),C43=0),AND(NOT(Q44=0),C44=0),AND(NOT(Q45=0),C45=0),),\"Please make sure GL is included\",\"\")","v":""}]
[null,null,null,{"$f":"IF(OR(AND(NOT(Q26=0),B26=0),AND(NOT(Q27=0),B27=0),AND(NOT(Q28=0),B28=0),AND(NOT(Q29=0),B26=0),AND(NOT(Q29=0),B26=0),AND(NOT(Q30=0),B30=0),AND(NOT(Q31=0),B31=0),AND(NOT(Q32=0),B32=0),AND(NOT(Q33=0),B33=0),AND(NOT(Q34=0),B34=0),AND(NOT(Q35=0),B35=0),AND(NOT(Q36=0),B36=0),AND(NOT(Q37=0),B37=0),AND(NOT(Q37=0),B37=0),AND(NOT(Q38=0),B38=0),AND(NOT(Q39=0),B39=0),AND(NOT(Q40=0),B40=0),AND(NOT(Q41=0),B41=0),AND(NOT(Q42=0),B42=0),AND(NOT(Q43=0),B43=0),AND(NOT(Q44=0),B44=0),AND(NOT(Q45=0),B45=0),),\"Please include country of origin\",\"\")","v":""},null,null,null,null,null,{"$f":"IF(OR(AND(NOT(Q26=0),E26=0),AND(NOT(Q27=0),E27=0),AND(NOT(Q28=0),E28=0),AND(NOT(Q29=0),E29=0),AND(NOT(Q29=0),E26=0),AND(NOT(Q30=0),E30=0),AND(NOT(Q31=0),E31=0),AND(NOT(Q32=0),E32=0),AND(NOT(Q33=0),E33=0),AND(NOT(Q34=0),E34=0),AND(NOT(Q35=0),E35=0),AND(NOT(Q36=0),E36=0),AND(NOT(Q37=0),E37=0),AND(NOT(Q37=0),E37=0),AND(NOT(Q38=0),E38=0),AND(NOT(Q39=0),E39=0),AND(NOT(Q40=0),E40=0),AND(NOT(Q41=0),E41=0),AND(NOT(Q42=0),E42=0),AND(NOT(Q43=0),E43=0),AND(NOT(Q44=0),E44=0),AND(NOT(Q45=0),E45=0),),\"Please make sure description is included\",\"\")","v":""}]
["Total Deposit Expected",null,null,{"$f":"IF(SUM(Q26:Q45)=C22,\" \",\"Please check all deposit amount!\")","v":" "}]
[]
["Cost Object","Country of Origin","G/L Account","G/L Account Name","Description (will appear on statement)",null,null,null,null,null,null,null,null,null,null,null,"Total ","Date of Deposit"]
[null,null,null,null,"40 characters (with spaces) limit",null,null,null,null,null,null,null,null,null,null,null,"Deposit","(if different from today)"]
[null,null,null,{"$f":"IFERROR(VLOOKUP(C26,'Hidden List and Formulas'!C$2:D$16,2,FALSE),IF(C26=\"\",\"\",IF(NOT(LEN(C26)=6),IFERROR(VLOOKUP(C26,'Hidden List and Formulas'!I:J,2,FALSE),\"G/L provided not 6 numbers\"),IFERROR(VLOOKUP(C26,'Hidden List and Formulas'!I:J,2,FALSE),\"G/L provided not in system\"))))","v":""},null,null,null,null,null,null,null,null,null,null,null,null,null,null,{"$f":"IF(C26=800303,\"Please contact Cashier's Office before using 800303 or this will be sent back\",IF(AND(NOT(Q26=0),OR(E26=0,C26=0,B26=0,A26=0)),\"Please Check for Errors\",IF(Q26>=25000,\"Please contact Cashiers office before sending for deposits over $25,000\",\"\")))","v":""}]
[null,null,null,{"$f":"IFERROR(VLOOKUP(C27,'Hidden List and Formulas'!C$2:D$16,2,FALSE),IF(C27=\"\",\"\",IF(NOT(LEN(C27)=6),IFERROR(VLOOKUP(C27,'Hidden List and Formulas'!I:J,2,FALSE),\"G/L provided not 6 numbers\"),IFERROR(VLOOKUP(C27,'Hidden List and Formulas'!I:J,2,FALSE),\"G/L provided not in system\"))))","v":""},null,null,null,null,null,null,null,null,null,null,null,null,null,null,{"$f":"IF(C27=800303,\"Please contact Cashier's Office before using 800303 or this will be sent back\",IF(AND(NOT(Q27=0),OR(E27=0,C27=0,B27=0,A27=0)),\"Please Check for Errors\",IF(Q27>=25000,\"Please contact Cashiers office before sending for deposits over $25,000\",\"\")))","v":""}]
[null,null,null,{"$f":"IFERROR(VLOOKUP(C28,'Hidden List and Formulas'!C$2:D$16,2,FALSE),IF(C28=\"\",\"\",IF(NOT(LEN(C28)=6),IFERROR(VLOOKUP(C28,'Hidden List and Formulas'!I:J,2,FALSE),\"G/L provided not 6 numbers\"),IFERROR(VLOOKUP(C28,'Hidden List and Formulas'!I:J,2,FALSE),\"G/L provided not in system\"))))","v":""},null,null,null,null,null,null,null,null,null,null,null,null,null,null,""]
[null,null,null,{"$f":"IFERROR(VLOOKUP(C29,'Hidden List and Formulas'!C$2:D$16,2,FALSE),IF(C29=\"\",\"\",IF(NOT(LEN(C29)=6),IFERROR(VLOOKUP(C29,'Hidden List and Formulas'!I:J,2,FALSE),\"G/L provided not 6 numbers\"),IFERROR(VLOOKUP(C29,'Hidden List and Formulas'!I:J,2,FALSE),\"G/L provided not in system\"))))","v":""},null,null,null,null,null,null,null,null,null,null,null,null,null,null,""]
[null,null,null,{"$f":"IFERROR(VLOOKUP(C30,'Hidden List and Formulas'!C$2:D$16,2,FALSE),IF(C30=\"\",\"\",IF(NOT(LEN(C30)=6),IFERROR(VLOOKUP(C30,'Hidden List and Formulas'!I:J,2,FALSE),\"G/L provided not 6 numbers\"),IFERROR(VLOOKUP(C30,'Hidden List and Formulas'!I:J,2,FALSE),\"G/L provided not in system\"))))","v":""},null,null,null,null,null,null,null,null,null,null,null,null,null,null,""]
{"$rows_left_out":24}
{"sheet":"Sheet1","index":1,"n_rows":105,"n_cols":9,"rows_kept":105,"cut":false,"hidden":true,"merged":[]}
["LOCATION ","Name","Department","PHONE","BLGD ","ACCOUNT/GL",null,"E-MAIL"]
["#",null,null,"#","#","#"]
[26,"Admissions","James Blessing","258-5528","3-001","1387001/1387003-800304",null,"jyb@mit.edu",{"$f":"CONCATENATE(A3,\"-\",B3)","v":"26-Admissions"}]
[71,"Aero/Astro","Ping Lee","253-8964","33-214C",null,null,"pmlee@mit.edu",{"$f":"CONCATENATE(A4,\"-\",B4)","v":"71-Aero/Astro"}]
[53,"Air Force ROTC","Ann Cronin","253-4475","W59-114",null,null,"airforce@mit.edu",{"$f":"CONCATENATE(A5,\"-\",B5)","v":"53-Air Force ROTC"}]
[98,"Alumni Association","Kim Warner","258-6009","W98-318",null,null,"warner@mit.edu",{"$f":"CONCATENATE(A6,\"-\",B6)","v":"98-Alumni Association"}]
[58,"Architecture","Doug Levie","253-9824","7-337B",null,null,"dougl@mit.edu",{"$f":"CONCATENATE(A7,\"-\",B7)","v":"58-Architecture"}]
[12,"Arts at MIT","Stacy Pyron","253-4003","E15-205A",null,null,"stacyp@mit.edu",{"$f":"CONCATENATE(A8,\"-\",B8)","v":"12-Arts at MIT"}]
[104,"Arts Culture & Technology","Andrew Barosy","324-3639","E15-211",null,null,"ajbarosy@mit.edu",{"$f":"CONCATENATE(A9,\"-\",B9)","v":"104-Arts Culture & Technology"}]
[56,"ASO","Gracie White","253-4568","8-328",null,null,"graciew@mit.edu",{"$f":"CONCATENATE(A10,\"-\",B10)","v":"56-ASO"}]
[30,"Athletics","Greg Harris","253-3608","W32-109","various accounts",null,"gharris@mit.edu",{"$f":"CONCATENATE(A11,\"-\",B11)","v":"30-Athletics"}]
[13,"BE Grad Student Board","Susan Jaskela","253-1712","16-267",null,null,"sjj@mit.edu",{"$f":"CONCATENATE(A12,\"-\",B12)","v":"13-BE Grad Student Board"}]
[96,"Building Technology","Kate McAngus","253-0463","5-418",null,null,"mcangus@mit.edu",{"$f":"CONCATENATE(A13,\"-\",B13)","v":"96-Building Technology"}]
[20,"Campus Activities","Lauren Smock-Randall","253-3913","W20-027","1735301-801021/1741100",null,"laurensr@mit.edu ",{"$f":"CONCATENATE(A14,\"-\",B14)","v":"20-Campus Activities"}]
[27,"Card Office","Lin Lee Shueh","253-3475","W20-021","1679400-800303",null,"sllee@mit.edu",{"$f":"CONCATENATE(A15,\"-\",B15)","v":"27-Card Office"}]
[10,"Cashiers","Cheryl Whelan","253-5426","NE49-3077",100150,null,"cwhelan@mit.edu",{"$f":"CONCATENATE(A16,\"-\",B16)","v":"10-Cashiers"}]
[103,"CEE Geotech","Carolyn Jundzilo-Comer","253-3280","1-342",null,null,"jundzilo@mit.edu",{"$f":"CONCATENATE(A17,\"-\",B17)","v":"103-CEE Geotech"}]
[80,"Center for Transportation & Logistics","Nick Burns","253-0118","E40-282",null,null,"nburns@mit.edu",{"$f":"CONCATENATE(A18,\"-\",B18)","v":"80-Center for Transportation & Logistics"}]
[92,"Civil & Environmental Engineering ","Nancy Cook","253-7104","1-284",null,null,"pwhesley@MIT.EDU",{"$f":"CONCATENATE(A19,\"-\",B19)","v":"92-Civil & Environmental Engineering "}]
[62,"Community Giving","Traci Swartz","253-7914","E19-432",null,null,"tswartz@mit.edu",{"$f":"CONCATENATE(A20,\"-\",B20)","v":"62-Community Giving"}]
[77,"Community Service Fund","Emily Paramore","253-1988","11-245",null,null,"paramore@mit.edu",{"$f":"CONCATENATE(A21,\"-\",B21)","v":"77-Community Service Fund"}]
[64,"Community Services","Traci Swartz","253-7914","E19-432",null,null,"tswartz@mit.edu",{"$f":"CONCATENATE(A22,\"-\",B22)","v":"64-Community Services"}]
[46,"Conference Services","Sudha Cheruku","253-1703","12-156",null,null,"scheruku@MIT.EDU",{"$f":"CONCATENATE(A23,\"-\",B23)","v":"46-Conference Services"}]
[40,"Copy Tech ","Rita DelPrete","258-0334","3-015A","various accounts",null,"ritadel@mit.edu",{"$f":"CONCATENATE(A24,\"-\",B24)","v":"40-Copy Tech "}]
[99,"CTPIDLogo2","Clinton Campbell","258-7973","E38-659",null,null,"clintonc@mit.edu",{"$f":"CONCATENATE(A25,\"-\",B25)","v":"99-CTPIDLogo2"}]
[49,"Dental","Tom Cafarella","258-5254","E23-530","1662000-801055",null,"cafa@med.mit.edu",{"$f":"CONCATENATE(A26,\"-\",B26)","v":"49-Dental"}]
[100,"D-Lab","Elisha Clark","324-4887","N51-319",null,null,"eliclark@mit.edu",{"$f":"CONCATENATE(A27,\"-\",B27)","v":"100-D-Lab"}]
[{"$f":"COUNT(A11:A27)","v":17},"DLC's Deposits to Bof A",null,null,null,null,null,null,{"$f":"CONCATENATE(A28,\"-\",B28)","v":"17-DLC's Deposits to Bof A"}]
[{"$f":"COUNT(A1:A27)","v":25},"DLC's Deposits to Bof A",null,null,null,null,null,null,{"$f":"CONCATENATE(A29,\"-\",B29)","v":"25-DLC's Deposits to Bof A"}]
[79,"DMSE","Jared Embelton","252-1163","16-244",null,null,"jarede@mit.edu",{"$f":"CONCATENATE(A30,\"-\",B30)","v":"79-DMSE"}]
{"$rows_left_out":76}
{"sheet":"Hidden List and Formulas","index":2,"n_rows":2282,"n_cols":11,"rows_kept":2282,"cut":false,"hidden":true,"merged":[]}
[null,"GL",null,"Name",null,"(I do not know)",null,null,"Gl Account Id","Gl Account Name"]
[null,801035,{"$f":"CONCATENATE(B2,\"-\",D2)","v":"801035-Sales"},{"$f":"VLOOKUP(B2,I:J,2,FALSE)","v":"Sales"},null,"United States of America     ",null,null,102072,"Glen V & Phyllis F Dorflinger Charitable Remainder",102072]
[null,801050,"801050-Non Degree Program Fees",{"$f":"VLOOKUP(B3,I:J,2,FALSE)","v":"Non Degree Program Fees"},null,"Canada        ",null,null,102073,"Vernon H Grigg Charitable Remainder Unitrust",102073]
[null,801018,"801018-Income - Outside Services","Income - Outside Services",null,"Albania        ",null,null,102074,"Henry Clyde Jonson Annuity Trust",102074]
[null,801063,"801063-Conferences & Events Revenue","Conferences & Events Revenue",null,"Algeria        ",null,null,102075,"Victor K & Elizabeth T Atkins Unitrust",102075]
[null,800304,"800304-Fee Income","Fee Income",null,"Andorra        ",null,null,102076,"Edgar P Eaton Jr (1944) - G A Unitrust",102076]
[null,801053,"801053-Subscriptions Revenue","Subscriptions Revenue",null,"Angola        ",null,null,102077,"Denman K McNear Unitrust",102077]
[null,801055,"801055-Medical/Dental Insurance Revenue","Medical/Dental Insurance Revenue",null,"Antigua and Barbadus      ",null,null,102078,"George B Raymond 1955 Unitrust",102078]
[null,801054,"801054-Transcript Fees","Transcript Fees",null,"Argentina        ",null,null,102079,"Edward(1934) & Annette Asch Char Remain Unitrust",102079]
[null,800600,"800600-Sponsored Billings","Sponsored Billings",null,"Armenia        ",null,null,102080,"James A Stern Charitable Remainder Unitrust",102080]
[null,801019,"801019-Permissions Revenue","Permissions Revenue",null,"Australia        ",null,null,102081,"Gunther W Balz Unitrust",102081]
[null,800311,"800311-Expense Reimbursement","Expense Reimbursement",null,"Austria        ",null,null,102082,"Harold A B Mcinnes Unitrust",102082]
[null,801021,"801021-Income - Building Usage","Income - Building Usage",null,"Azerbaijan        ",null,null,102083,"Ernest U Buckman Unitrust",102083]
[null,420050,"420050-Travel Expenses","Travel Expenses",null,"Bahamas        ",null,null,102084,"John M and Jane G Bradley Unitrust",102084]
[null,420070,"420070-Travel-Foreign Expenses","Travel-Foreign Expenses",null,"Bahrain        ",null,null,102085,"Nancy & Bryron Lutman Charit Remaind Unitrst",102085]
[null,null,"-",null,null,"Bangladesh        ",null,null,102086,"Katherine S Hazen Unitrust",102086]
[null,null,"-",null,null,"Barbados        ",null,null,102087,"Landon T Clay Fund",102087]
[null,null,"-",null,null,"Belarus        ",null,null,102088,"John(1941)&Elizabeth Stern Chart Remainbl Unitrust",102088]
[null,null,"-",null,null,"Belgium        ",null,null,102089,"Paul M Cook Fund",102089]
[null,null,"-",null,null,"Belize        ",null,null,102090,"J Marshall Cole",102090]
[null,null,"-",null,null,"Benin        ",null,null,102091,"Topsfield Fund #1",102091]
[null,null,"-",null,null,"Bhutan        ",null,null,102092,"C B & R J Damartini (1941) Unitrust",102092]
[null,null,"-",null,null,"Bolivia        ",null,null,102093,"Donald(1950)&Sigrid Harnsberger Chart Rem Trust",102093]
[null,null,"-",null,null,"Botswana        ",null,null,102094,"Compton Pooled Income Fund",102094]
[null,null,"-",null,null,"Brazil        ",null,null,102095,"Geroge R & Mary Jo Dvorak (1945) Unitrust",102095]
[null,null,"-",null,null,"Brunei Darussalam       ",null,null,102096,"Paul K (1947) Mary L Schilling Unitrust",102096]
[null,null,"-",null,null,"Bulgaria        ",null,null,102097,"David B Powers Unitrust #3",102097]
[null,null,"-",null,null,"Burkina Faso       ",null,null,102098,"Anonymous O Research Fund",102098]
[null,null,"-",null,null,"Burundi        ",null,null,102099,"Herbert F (1944) & Glenna Knape Unitrust",102099]
[null,null,"-",null,null,"Cambodia        ",null,null,102100,"Concordia Chen (1962) Unitrust",102100]
{"$rows_left_out":2253}
{"sheet":"SAP Post","index":3,"n_rows":0,"n_cols":0,"rows_kept":0,"cut":false,"hidden":true,"merged":[]}

{"sheet":"JV","index":4,"n_rows":23,"n_cols":9,"rows_kept":23,"cut":false,"hidden":true,"merged":[[0,8,0,12]]}
[null,null,100530,{"$f":"VLOOKUP(Form!E14,Sheet1!B:I,8,FALSE)","v":{"$error":"#N/A"}},{"$f":"Form!$B$15","v":"2014-05-30"},{"$f":"Form!$B$48","v":0},{"$f":"\" \"","v":" "},null,"Please do not touch anything on this sheet"]
[{"$f":"IF(NOT(D2=\" \"),IF(OR(A3=\"X\",A4=\"X\",A5=\"X\",A5=\"X\",A6=\"X\",A7=\"X\",A8=\"X\",A9=\"X\",A10=\"X\",A11=\"X\",A12=\"X\",A13=\"X\",A14=\"X\",A15=\"X\",A16=\"X\",A17=\"X\",A18=\"X\",A19=\"X\",A20=\"X\",A21=\"X\",A22=\"X\",),\" \",\"X\"),\" \")","v":" "},{"$f":"IF(NOT(G2=\" \"),Form!A26,\" \")","v":" "},{"$f":"IF(NOT(G2=\" \"),VLOOKUP(Form!C26,'Hidden List and Formulas'!I:K,3,FALSE),\" \")","v":" "},{"$f":"IF(NOT(G2=\" \"),Form!E26,\" \")","v":" "},{"$f":"IF(G2=\" \",IF(F2=\" \",\" \",IF(Form!R26>0,Form!R26,Form!$B$15)),IF(Form!R26>0,Form!R26,Form!$B$15))","v":" "},{"$f":"\" \"","v":" "},{"$f":"IF(Form!Q26>0,Form!Q26,\" \")","v":" "}]
[{"$f":"IF(NOT(D3=\" \"),IF(OR(A4=\"X\",A5=\"X\",A6=\"X\",A6=\"X\",A7=\"X\",A8=\"X\",A9=\"X\",A10=\"X\",A11=\"X\",A12=\"X\",A13=\"X\",A14=\"X\",A15=\"X\",A16=\"X\",A17=\"X\",A18=\"X\",A19=\"X\",A20=\"X\",A21=\"X\",A22=\"X\",A23=\"X\",),\" \",\"X\"),\" \")","v":" "},{"$f":"IF(NOT(G3=\" \"),Form!A27,\" \")","v":" "},{"$f":"IF(NOT(G3=\" \"),VLOOKUP(Form!C27,'Hidden List and Formulas'!I:K,3,FALSE),\" \")","v":" "},{"$f":"IF(NOT(G3=\" \"),Form!E27,\" \")","v":" "},{"$f":"IF(G3=\" \",IF(F3=\" \",\" \",IF(Form!R27>0,Form!R27,Form!$B$15)),IF(Form!R27>0,Form!R27,Form!$B$15))","v":" "},{"$f":"\" \"","v":" "},{"$f":"IF(Form!Q27>0,Form!Q27,\" \")","v":" "}]
[" ",{"$f":"IF(NOT(G4=\" \"),Form!A28,\" \")","v":" "},{"$f":"IF(NOT(G4=\" \"),VLOOKUP(Form!C28,'Hidden List and Formulas'!I:K,3,FALSE),\" \")","v":" "},{"$f":"IF(NOT(G4=\" \"),Form!E28,\" \")","v":" "},{"$f":"IF(G4=\" \",IF(F4=\" \",\" \",IF(Form!R28>0,Form!R28,Form!$B$15)),IF(Form!R28>0,Form!R28,Form!$B$15))","v":" "}," ",{"$f":"IF(Form!Q28>0,Form!Q28,\" \")","v":" "}]
[" ",{"$f":"IF(NOT(G5=\" \"),Form!A29,\" \")","v":" "},{"$f":"IF(NOT(G5=\" \"),VLOOKUP(Form!C29,'Hidden List and Formulas'!I:K,3,FALSE),\" \")","v":" "},{"$f":"IF(NOT(G5=\" \"),Form!E29,\" \")","v":" "},{"$f":"IF(G5=\" \",IF(F5=\" \",\" \",IF(Form!R29>0,Form!R29,Form!$B$15)),IF(Form!R29>0,Form!R29,Form!$B$15))","v":" "}," ",{"$f":"IF(Form!Q29>0,Form!Q29,\" \")","v":" "}]
[" ",{"$f":"IF(NOT(G6=\" \"),Form!A30,\" \")","v":" "},{"$f":"IF(NOT(G6=\" \"),VLOOKUP(Form!C30,'Hidden List and Formulas'!I:K,3,FALSE),\" \")","v":" "},{"$f":"IF(NOT(G6=\" \"),Form!E30,\" \")","v":" "},{"$f":"IF(G6=\" \",IF(F6=\" \",\" \",IF(Form!R30>0,Form!R30,Form!$B$15)),IF(Form!R30>0,Form!R30,Form!$B$15))","v":" "}," ",{"$f":"IF(Form!Q30>0,Form!Q30,\" \")","v":" "}]
[" ",{"$f":"IF(NOT(G7=\" \"),Form!A31,\" \")","v":" "},{"$f":"IF(NOT(G7=\" \"),VLOOKUP(Form!C31,'Hidden List and Formulas'!I:K,3,FALSE),\" \")","v":" "},{"$f":"IF(NOT(G7=\" \"),Form!E31,\" \")","v":" "},{"$f":"IF(G7=\" \",IF(F7=\" \",\" \",IF(Form!R31>0,Form!R31,Form!$B$15)),IF(Form!R31>0,Form!R31,Form!$B$15))","v":" "}," ",{"$f":"IF(Form!Q31>0,Form!Q31,\" \")","v":" "}]
[" ",{"$f":"IF(NOT(G8=\" \"),Form!A32,\" \")","v":" "},{"$f":"IF(NOT(G8=\" \"),VLOOKUP(Form!C32,'Hidden List and Formulas'!I:K,3,FALSE),\" \")","v":" "},{"$f":"IF(NOT(G8=\" \"),Form!E32,\" \")","v":" "},{"$f":"IF(G8=\" \",IF(F8=\" \",\" \",IF(Form!R32>0,Form!R32,Form!$B$15)),IF(Form!R32>0,Form!R32,Form!$B$15))","v":" "}," ",{"$f":"IF(Form!Q32>0,Form!Q32,\" \")","v":" "}]
[" ",{"$f":"IF(NOT(G9=\" \"),Form!A33,\" \")","v":" "},{"$f":"IF(NOT(G9=\" \"),VLOOKUP(Form!C33,'Hidden List and Formulas'!I:K,3,FALSE),\" \")","v":" "},{"$f":"IF(NOT(G9=\" \"),Form!E33,\" \")","v":" "},{"$f":"IF(G9=\" \",IF(F9=\" \",\" \",IF(Form!R33>0,Form!R33,Form!$B$15)),IF(Form!R33>0,Form!R33,Form!$B$15))","v":" "}," ",{"$f":"IF(Form!Q33>0,Form!Q33,\" \")","v":" "}]
[" ",{"$f":"IF(NOT(G10=\" \"),Form!A34,\" \")","v":" "},{"$f":"IF(NOT(G10=\" \"),VLOOKUP(Form!C34,'Hidden List and Formulas'!I:K,3,FALSE),\" \")","v":" "},{"$f":"IF(NOT(G10=\" \"),Form!E34,\" \")","v":" "},{"$f":"IF(G10=\" \",IF(F10=\" \",\" \",IF(Form!R34>0,Form!R34,Form!$B$15)),IF(Form!R34>0,Form!R34,Form!$B$15))","v":" "}," ",{"$f":"IF(Form!Q34>0,Form!Q34,\" \")","v":" "}]
[" ",{"$f":"IF(NOT(G11=\" \"),Form!A35,\" \")","v":" "},{"$f":"IF(NOT(G11=\" \"),VLOOKUP(Form!C35,'Hidden List and Formulas'!I:K,3,FALSE),\" \")","v":" "},{"$f":"IF(NOT(G11=\" \"),Form!E35,\" \")","v":" "},{"$f":"IF(G11=\" \",IF(F11=\" \",\" \",IF(Form!R35>0,Form!R35,Form!$B$15)),IF(Form!R35>0,Form!R35,Form!$B$15))","v":" "}," ",{"$f":"IF(Form!Q35>0,Form!Q35,\" \")","v":" "}]
[" ",{"$f":"IF(NOT(G12=\" \"),Form!A36,\" \")","v":" "},{"$f":"IF(NOT(G12=\" \"),VLOOKUP(Form!C36,'Hidden List and Formulas'!I:K,3,FALSE),\" \")","v":" "},{"$f":"IF(NOT(G12=\" \"),Form!E36,\" \")","v":" "},{"$f":"IF(G12=\" \",IF(F12=\" \",\" \",IF(Form!R36>0,Form!R36,Form!$B$15)),IF(Form!R36>0,Form!R36,Form!$B$15))","v":" "}," ",{"$f":"IF(Form!Q36>0,Form!Q36,\" \")","v":" "}]
[" ",{"$f":"IF(NOT(G13=\" \"),Form!A37,\" \")","v":" "},{"$f":"IF(NOT(G13=\" \"),VLOOKUP(Form!C37,'Hidden List and Formulas'!I:K,3,FALSE),\" \")","v":" "},{"$f":"IF(NOT(G13=\" \"),Form!E37,\" \")","v":" "},{"$f":"IF(G13=\" \",IF(F13=\" \",\" \",IF(Form!R37>0,Form!R37,Form!$B$15)),IF(Form!R37>0,Form!R37,Form!$B$15))","v":" "}," ",{"$f":"IF(Form!Q37>0,Form!Q37,\" \")","v":" "}]
[" ",{"$f":"IF(NOT(G14=\" \"),Form!A38,\" \")","v":" "},{"$f":"IF(NOT(G14=\" \"),VLOOKUP(Form!C38,'Hidden List and Formulas'!I:K,3,FALSE),\" \")","v":" "},{"$f":"IF(NOT(G14=\" \"),Form!E38,\" \")","v":" "},{"$f":"IF(G14=\" \",IF(F14=\" \",\" \",IF(Form!R38>0,Form!R38,Form!$B$15)),IF(Form!R38>0,Form!R38,Form!$B$15))","v":" "}," ",{"$f":"IF(Form!Q38>0,Form!Q38,\" \")","v":" "}]
[" ",{"$f":"IF(NOT(G15=\" \"),Form!A39,\" \")","v":" "},{"$f":"IF(NOT(G15=\" \"),VLOOKUP(Form!C39,'Hidden List and Formulas'!I:K,3,FALSE),\" \")","v":" "},{"$f":"IF(NOT(G15=\" \"),Form!E39,\" \")","v":" "},{"$f":"IF(G15=\" \",IF(F15=\" \",\" \",IF(Form!R39>0,Form!R39,Form!$B$15)),IF(Form!R39>0,Form!R39,Form!$B$15))","v":" "}," ",{"$f":"IF(Form!Q39>0,Form!Q39,\" \")","v":" "}]
[" ",{"$f":"IF(NOT(G16=\" \"),Form!A40,\" \")","v":" "},{"$f":"IF(NOT(G16=\" \"),VLOOKUP(Form!C40,'Hidden List and Formulas'!I:K,3,FALSE),\" \")","v":" "},{"$f":"IF(NOT(G16=\" \"),Form!E40,\" \")","v":" "},{"$f":"IF(G16=\" \",IF(F16=\" \",\" \",IF(Form!R40>0,Form!R40,Form!$B$15)),IF(Form!R40>0,Form!R40,Form!$B$15))","v":" "}," ",{"$f":"IF(Form!Q40>0,Form!Q40,\" \")","v":" "}]
[" ",{"$f":"IF(NOT(G17=\" \"),Form!A41,\" \")","v":" "},{"$f":"IF(NOT(G17=\" \"),VLOOKUP(Form!C41,'Hidden List and Formulas'!I:K,3,FALSE),\" \")","v":" "},{"$f":"IF(NOT(G17=\" \"),Form!E41,\" \")","v":" "},{"$f":"IF(G17=\" \",IF(F17=\" \",\" \",IF(Form!R41>0,Form!R41,Form!$B$15)),IF(Form!R41>0,Form!R41,Form!$B$15))","v":" "}," ",{"$f":"IF(Form!Q41>0,Form!Q41,\" \")","v":" "}]
[" ",{"$f":"IF(NOT(G18=\" \"),Form!A42,\" \")","v":" "},{"$f":"IF(NOT(G18=\" \"),VLOOKUP(Form!C42,'Hidden List and Formulas'!I:K,3,FALSE),\" \")","v":" "},{"$f":"IF(NOT(G18=\" \"),Form!E42,\" \")","v":" "},{"$f":"IF(G18=\" \",IF(F18=\" \",\" \",IF(Form!R42>0,Form!R42,Form!$B$15)),IF(Form!R42>0,Form!R42,Form!$B$15))","v":" "}," ",{"$f":"IF(Form!Q42>0,Form!Q42,\" \")","v":" "}]
[" ",{"$f":"IF(NOT(G19=\" \"),Form!A43,\" \")","v":" "},{"$f":"IF(NOT(G19=\" \"),VLOOKUP(Form!C43,'Hidden List and Formulas'!I:K,3,FALSE),\" \")","v":" "},{"$f":"IF(NOT(G19=\" \"),Form!E43,\" \")","v":" "},{"$f":"IF(G19=\" \",IF(F19=\" \",\" \",IF(Form!R43>0,Form!R43,Form!$B$15)),IF(Form!R43>0,Form!R43,Form!$B$15))","v":" "}," ",{"$f":"IF(Form!Q43>0,Form!Q43,\" \")","v":" "}]
[" ",{"$f":"IF(NOT(G20=\" \"),Form!A44,\" \")","v":" "},{"$f":"IF(NOT(G20=\" \"),VLOOKUP(Form!C44,'Hidden List and Formulas'!I:K,3,FALSE),\" \")","v":" "},{"$f":"IF(NOT(G20=\" \"),Form!E44,\" \")","v":" "},{"$f":"IF(G20=\" \",IF(F20=\" \",\" \",IF(Form!R44>0,Form!R44,Form!$B$15)),IF(Form!R44>0,Form!R44,Form!$B$15))","v":" "}," ",{"$f":"IF(Form!Q44>0,Form!Q44,\" \")","v":" "}]
[" ",{"$f":"IF(NOT(G21=\" \"),Form!A45,\" \")","v":" "},{"$f":"IF(NOT(G21=\" \"),VLOOKUP(Form!C45,'Hidden List and Formulas'!I:K,3,FALSE),\" \")","v":" "},{"$f":"IF(NOT(G21=\" \"),Form!E45,\" \")","v":" "},{"$f":"IF(G21=\" \",IF(F21=\" \",\" \",IF(Form!R45>0,Form!R45,Form!$B$15)),IF(Form!R45>0,Form!R45,Form!$B$15))","v":" "}," ",{"$f":"IF(Form!Q45>0,Form!Q45,\" \")","v":" "}]
[]
[null,null,null,null,null,null,{"$f":"\" \"","v":" "}]